Target
Peptidyl-prolyl cis-trans isomerase FKBP1A
Ligand
BDBM50228122
Substrate
Meas. Tech.
ChEMBL_452413 (CHEMBL902649)
Kd
505000±n/a nM
Citation
 Stebbins, JLZhang, ZChen, JWu, BEmdadi, AWilliams, MECashman, JPellecchia, M Nuclear magnetic resonance fragment-based identification of novel FKBP12 inhibitors. J Med Chem 50:6607-17 (2007)  
Target
Name:
Peptidyl-prolyl cis-trans isomerase FKBP1A
Synonyms:
12 kDa FK506-binding protein FK506-binding protein 1A FKB1A_HUMAN FKBP-1A FKBP12 Immunophilin FKBP12 PPIase FKBP1A Rotamase mTOR/FKBP12A/FKBP12B
Type:
Isomerase
Mol. Mass.:
11953.09
Organism:
Homo sapiens (Human)
Description:
P62942
Residue:
108
  
Inhibitor
Name:
BDBM50228122
Synonyms:
CHEMBL236367 | methyl 4-(2-(4-isopropylphenylsulfonyl)acetyl)morpholine-3-carboxylate
Type:
Small organic molecule
Emp. Form.:
C17H23NO6S
Mol. Mass.:
369.433
SMILES:
COC(=O)C1COCCN1C(=O)CS(=O)(=O)c1ccc(cc1)C(C)C
: