Target
Peptidyl-prolyl cis-trans isomerase FKBP1A
Ligand
BDBM50228129
Substrate
Meas. Tech.
ChEMBL_452413 (CHEMBL902649)
Kd
231000±n/a nM
Citation
 Stebbins, JLZhang, ZChen, JWu, BEmdadi, AWilliams, MECashman, JPellecchia, M Nuclear magnetic resonance fragment-based identification of novel FKBP12 inhibitors. J Med Chem 50:6607-17 (2007)  
Target
Name:
Peptidyl-prolyl cis-trans isomerase FKBP1A
Synonyms:
12 kDa FK506-binding protein FK506-binding protein 1A FKB1A_HUMAN FKBP-1A FKBP12 Immunophilin FKBP12 PPIase FKBP1A Rotamase mTOR/FKBP12A/FKBP12B
Type:
Isomerase
Mol. Mass.:
11953.09
Organism:
Homo sapiens (Human)
Description:
P62942
Residue:
108
  
Inhibitor
Name:
BDBM50228129
Synonyms:
2-(4-chloro-3,5-dimethylphenoxy)-1-morpholinoethanone | CHEMBL235468
Type:
Small organic molecule
Emp. Form.:
C14H18ClNO3
Mol. Mass.:
283.751
SMILES:
Cc1cc(OCC(=O)N2CCOCC2)cc(C)c1Cl
: