Target
Peptidyl-prolyl cis-trans isomerase FKBP1A
Ligand
BDBM50228126
Substrate
Meas. Tech.
ChEMBL_452413 (CHEMBL902649)
Kd
>5000000±n/a nM
Citation
 Stebbins, JLZhang, ZChen, JWu, BEmdadi, AWilliams, MECashman, JPellecchia, M Nuclear magnetic resonance fragment-based identification of novel FKBP12 inhibitors. J Med Chem 50:6607-17 (2007)  
Target
Name:
Peptidyl-prolyl cis-trans isomerase FKBP1A
Synonyms:
12 kDa FK506-binding protein FK506-binding protein 1A FKB1A_HUMAN FKBP-1A FKBP12 Immunophilin FKBP12 PPIase FKBP1A Rotamase mTOR/FKBP12A/FKBP12B
Type:
Isomerase
Mol. Mass.:
11953.09
Organism:
Homo sapiens (Human)
Description:
P62942
Residue:
108
  
Inhibitor
Name:
BDBM50228126
Synonyms:
2-(2-methoxy-4-((thiophen-2-ylmethylamino)methyl)phenoxy)-1-morpholinoethanone | CHEMBL235080
Type:
Small organic molecule
Emp. Form.:
C19H24N2O4S
Mol. Mass.:
376.47
SMILES:
COc1cc(CNCc2cccs2)ccc1OCC(=O)N1CCOCC1
: