Target
Complement C1s subcomponent
Ligand
BDBM50233689
Substrate
Meas. Tech.
ChEMBL_462407 (CHEMBL927223)
Ki
64±n/a nM
Citation
 Travins, JMAli, FHuang, HBallentine, SKKhalil, EHufnagel, HRPan, WGushue, JLeonard, KBone, RFSoll, RMDesJarlais, RLCrysler, CSNinan, NKirkpatrick, JCummings, MDHuebert, NMolloy, CJGaul, MTomczuk, BESubasinghe, NL Biphenylsulfonyl-thiophene-carboxamidine inhibitors of the complement component C1s. Bioorg Med Chem Lett 18:1603-6 (2008)  
Target
Name:
Complement C1s subcomponent
Synonyms:
C1 esterase C1S_HUMAN Complement C1s subcomponent Complement C1s subcomponent light chain Trypsin | complement component 1, s subcomponent
Type:
Protein
Mol. Mass.:
76657.91
Organism:
Homo sapiens (Human)
Description:
P09871
Residue:
688
  
Inhibitor
Name:
BDBM50233689
Synonyms:
5-methylsulfanyl-4-(6'-methyl-2'-{3-[2-(2H-tetrazol-5-yl)-ethyl]-ureido}-biphenyl-3-sulfonyl)-thiophene-2-carboxamidine | CHEMBL254283
Type:
Small organic molecule
Emp. Form.:
C23H24N8O3S3
Mol. Mass.:
556.683
SMILES:
CSc1sc(cc1S(=O)(=O)c1cccc(c1)-c1c(C)cccc1NC(=O)NCCc1nnn[nH]1)C(N)=N
: