Target
Urotensin-2 receptor
Ligand
BDBM50244022
Substrate
Meas. Tech.
ChEMBL_555221 (CHEMBL965358)
Ki
3±n/a nM
Citation
 McAtee, JJDodson, JWDowdell, SEErhard, KGirard, GRGoodman, KBHilfiker, MAJin, JSehon, CASha, DShi, DWang, FWang, GZWang, NWang, YViet, AQYuan, CCZhang, DAiyar, NVBehm, DJCarballo, LHEvans, CAFries, HENagilla, RRoethke, TJXu, XDouglas, SANeeb, MJ Potent and selective small-molecule human urotensin-II antagonists with improved pharmacokinetic profiles. Bioorg Med Chem Lett 18:3716-9 (2008)  
Target
Name:
Urotensin-2 receptor
Synonyms:
G-protein coupled receptor 14 UR-II-R UTS2R Urotensin-II
Type:
Enzyme Catalytic Domain
Mol. Mass.:
42159.71
Organism:
Homo sapiens (Human)
Description:
Urotensin-II UTS2R HUMAN::Q9UKP6
Residue:
389
  
Inhibitor
Name:
BDBM50244022
Synonyms:
CHEMBL449192 | N-[1-(4'-Acetylamino-biphenyl-4-yl)-2-morpholin-4-yl-ethyl]-2-(6,7-dimethyl-3-oxo-2,3-dihydro-benzo[1,4]oxazin-4-yl)-N-methyl-acetamide
Type:
Small organic molecule
Emp. Form.:
C33H38N4O5
Mol. Mass.:
570.6786
SMILES:
CN(C(CN1CCOCC1)c1ccc(cc1)-c1ccc(NC(C)=O)cc1)C(=O)CN1C(=O)COc2cc(C)c(C)cc12
: