Target
Angiotensin-converting enzyme
Ligand
BDBM50266170
Substrate
Meas. Tech.
ChEMBL_544516 (CHEMBL1013488)
IC50
21±n/a nM
Citation
 Enomoto, HMorikawa, YMiyake, YTsuji, FMizuchi, MSuhara, HFujimura, KHoriuchi, MBan, M Synthesis and biological evaluation of N-mercaptoacylcysteine derivatives as leukotriene A4 hydrolase inhibitors. Bioorg Med Chem Lett 19:442-6 (2008)  
Target
Name:
Angiotensin-converting enzyme
Synonyms:
ACE Angiotensin converting enzyme (ACE) Angiotensin-converting enzyme, soluble form CD_antigen=CD143 DCP1 Kininase II
Type:
Enzyme
Mol. Mass.:
149709.01
Organism:
Homo sapiens (Human)
Description:
Residue:
1306
  
Inhibitor
Name:
BDBM50266170
Synonyms:
(R)-3-(4-ethylbenzylthio)-2-((S)-3-mercapto-2-methylpropanamido)propanoic acid | CHEMBL511184
Type:
Small organic molecule
Emp. Form.:
C16H23NO3S2
Mol. Mass.:
341.489
SMILES:
CCc1ccc(CSC[C@H](NC(=O)[C@H](C)CS)C(O)=O)cc1
: