Target
Betaine--homocysteine S-methyltransferase 1
Ligand
BDBM50268055
Substrate
Meas. Tech.
ChEMBL_520155 (CHEMBL947843)
IC50
2500±n/a nM
Citation
 Vanek, VBudesínský, MKabeleová, PSanda, MKozísek, MHanclová, IMládková, JBrynda, JRosenberg, IKoutmos, MGarrow, TAJirácek, J Structure-activity study of new inhibitors of human betaine-homocysteine S-methyltransferase. J Med Chem 52:3652-65 (2009)  
Target
Name:
Betaine--homocysteine S-methyltransferase 1
Synonyms:
BHMT | BHMT1_HUMAN
Type:
PROTEIN
Mol. Mass.:
45000.99
Organism:
Homo sapiens (Human)
Description:
ChEMBL_970672
Residue:
406
  
Inhibitor
Name:
BDBM50268055
Synonyms:
(RS)-2-Amino-4-{2-[(carboxymethyl)(methyl)amino]ethylthio}-butanoic Acid | CHEMBL487301
Type:
Small organic molecule
Emp. Form.:
C9H18N2O4S
Mol. Mass.:
250.315
SMILES:
CN(CCSCCC(N)C(O)=O)CC(O)=O
: