Target
Retinoic acid receptor RXR-beta
Ligand
BDBM31892
Substrate
Meas. Tech.
ChEBML_197054
EC50
200±n/a nM
Citation
 Beard, RLColon, DFKlein, ESVorse, KAChandraratna, RA Differential RXR & RAR activity of stilbene retinoid analogs bearing thiazole and imidazole carboxylic acids Bioorg Med Chem Lett 5:2729-2734 (1995)    Article 
Target
Name:
Retinoic acid receptor RXR-beta
Synonyms:
NR2B2 RXRB Retinoic acid receptor RXR-beta Retinoid receptor
Type:
PROTEIN
Mol. Mass.:
56932.89
Organism:
Homo sapiens (Human)
Description:
ChEMBL_39045
Residue:
533
  
Inhibitor
Name:
BDBM31892
Synonyms:
9-cis retinoic acid CHEMBL705 alitretinoin
Type:
Small organic molecule
Emp. Form.:
C20H28O2
Mol. Mass.:
300.4351
SMILES:
C\C(\C=C\C1=C(C)CCCC1(C)C)=C\C=C\C(\C)=C\C(O)=O
: