Target
Retinoic acid receptor beta
Ligand
BDBM50032219
Substrate
Meas. Tech.
ChEBML_195473
EC50
3±n/a nM
Citation
 Beard, RLColon, DFKlein, ESVorse, KAChandraratna, RA Differential RXR & RAR activity of stilbene retinoid analogs bearing thiazole and imidazole carboxylic acids Bioorg Med Chem Lett 5:2729-2734 (1995)    Article 
Target
Name:
Retinoic acid receptor beta
Synonyms:
HAP NR1B2 RAR-beta RARB Retinoic acid receptor RXR-alpha/Retinoic acid receptor beta Retinoid receptor
Type:
PROTEIN
Mol. Mass.:
50498.70
Organism:
Homo sapiens (Human)
Description:
ChEMBL_1458015
Residue:
455
  
Inhibitor
Name:
BDBM50032219
Synonyms:
(E)-4-(2-(5,5,8,8-tetramethyl-5,6,7,8-tetrahydronaphthalen-2-yl)prop-1-enyl)benzoic acid 4-[(1E)-2-(5,5,8,8-TETRAMETHYL-5,6,7,8-TETRAHYDRONAPHTHALEN-2-YL)PROP-1-ENYL]BENZOIC ACID 4-[(E)-2-(5,6,7,8-tetrahydro-5,5,8,8-tetramethyl-2-naphthalenyl)-1-propenyl]benzoic acid CHEMBL275311 | US9963439, TTNPB
Type:
Small organic molecule
Emp. Form.:
C24H28O2
Mol. Mass.:
348.4779
SMILES:
C\C(=C/c1ccc(cc1)C(O)=O)c1ccc2c(c1)C(C)(C)CCC2(C)C
: