Target
Retinoic acid receptor alpha
Ligand
BDBM50285918
Substrate
Meas. Tech.
ChEBML_197380
EC50
690±n/a nM
Citation
 Beard, RLColon, DFKlein, ESVorse, KAChandraratna, RA Differential RXR & RAR activity of stilbene retinoid analogs bearing thiazole and imidazole carboxylic acids Bioorg Med Chem Lett 5:2729-2734 (1995)    Article 
Target
Name:
Retinoic acid receptor alpha
Synonyms:
NR1B1 RAR-alpha RARA_HUMAN Retinoic acid receptor alpha/Retinoid X receptor alpha Retinoid receptor
Type:
PROTEIN
Mol. Mass.:
50778.87
Organism:
Homo sapiens (Human)
Description:
ChEMBL_1466191
Residue:
462
  
Inhibitor
Name:
BDBM50285918
Synonyms:
5-[(E)-2-(5,5,8,8-Tetramethyl-5,6,7,8-tetrahydro-naphthalen-2-yl)-propenyl]-thiophene-2-carboxylic acid | CHEMBL93538
Type:
Small organic molecule
Emp. Form.:
C22H26O2S
Mol. Mass.:
354.506
SMILES:
C\C(=C/c1ccc(s1)C(O)=O)c1ccc2c(c1)C(C)(C)CCC2(C)C
: