Target
Retinoic acid receptor RXR-gamma
Ligand
BDBM50285921
Substrate
Meas. Tech.
ChEBML_197215
EC50
86±n/a nM
Citation
 Beard, RLColon, DFKlein, ESVorse, KAChandraratna, RA Differential RXR & RAR activity of stilbene retinoid analogs bearing thiazole and imidazole carboxylic acids Bioorg Med Chem Lett 5:2729-2734 (1995)    Article 
Target
Name:
Retinoic acid receptor RXR-gamma
Synonyms:
NR2B3 RXRG Retinoic acid receptor RXR-gamma Retinoid X receptor gamma/retinoic acid receptor alpha
Type:
PROTEIN
Mol. Mass.:
50878.26
Organism:
Homo sapiens (Human)
Description:
ChEMBL_197216
Residue:
463
  
Inhibitor
Name:
BDBM50285921
Synonyms:
3-Dimethylsulfamoyl-2-[(E)-2-(3,5,5,8,8-pentamethyl-5,6,7,8-tetrahydro-naphthalen-2-yl)-propenyl]-3H-imidazole-4-carboxylic acid | CHEMBL433178
Type:
Small organic molecule
Emp. Form.:
C24H33N3O4S
Mol. Mass.:
459.602
SMILES:
CN(C)S(=O)(=O)n1c(\C=C(/C)c2cc3c(cc2C)C(C)(C)CCC3(C)C)ncc1C(O)=O
: