Target
Adenosine receptor A1
Ligand
BDBM50287704
Substrate
Meas. Tech.
ChEMBL_29281 (CHEMBL640342)
IC50
91±n/a nM
Citation
 Akahane, AKatayama, HMitsunaga, TKita, YKusunoki, TTerai, TYoshida, KShiokawa, Y Discovery of FK453, a novel non-xanthine adenosine A1 receptor antagonist Bioorg Med Chem Lett 6:2059-2062 (1996)    Article 
Target
Name:
Adenosine receptor A1
Synonyms:
A1 adenosine receptor ADENOSINE A1 ADENOSINE A1 low Adenosine A1 receptor | Adenosine Receptor A1
Type:
Enzyme Catalytic Domain
Mol. Mass.:
36501.39
Organism:
GUINEA PIG
Description:
ADENOSINE A1 ADORA1 GUINEA PIG::P47745
Residue:
326
  
Inhibitor
Name:
BDBM50287704
Synonyms:
(E)-1-(2-Ethyl-piperidin-1-yl)-3-(2-methyl-6-phenyl-imidazo[2,1-b][1,3,4]thiadiazol-5-yl)-propenone | CHEMBL64108
Type:
Small organic molecule
Emp. Form.:
C21H24N4OS
Mol. Mass.:
380.506
SMILES:
CCC1CCCCN1C(=O)\C=C\c1c(nc2sc(C)nn12)-c1ccccc1
: