Target
Adenosine receptor A1
Ligand
BDBM21173
Substrate
Meas. Tech.
ChEBML_29281
IC50
1.3±n/a nM
Citation
 Akahane, AKatayama, HMitsunaga, TKita, YKusunoki, TTerai, TYoshida, KShiokawa, Y Discovery of FK453, a novel non-xanthine adenosine A1 receptor antagonist Bioorg Med Chem Lett 6:2059-2062 (1996)    Article 
Target
Name:
Adenosine receptor A1
Synonyms:
A1 adenosine receptor ADENOSINE A1 ADENOSINE A1 low Adenosine A1 receptor | Adenosine Receptor A1
Type:
Enzyme Catalytic Domain
Mol. Mass.:
36501.39
Organism:
GUINEA PIG
Description:
ADENOSINE A1 ADORA1 GUINEA PIG::P47745
Residue:
326
  
Inhibitor
Name:
BDBM21173
Synonyms:
1,3-dipropyl-8-cyclopentylxanthine CHEMBL183 PD116948 | [3H]DPCPX
Type:
radiolabeled ligand
Emp. Form.:
C16H24N4O2
Mol. Mass.:
304.3874
SMILES:
CCCn1c2nc([nH]c2c(=O)n(CCC)c1=O)C1CCCC1
: