Target
Histidinol dehydrogenase, chloroplastic
Ligand
BDBM50267976
Substrate
Meas. Tech.
ChEMBL_923891 (CHEMBL3082926)
Ki
2.9±n/a nM
Citation
 Dancer, JEFord, MJHamilton, KKilkelly, MLindell, SDO'Mahony, MJSaville-Stones, EA Synthesis of potent inhibitors of histidinol dehydrogenase Bioorg Med Chem Lett 6:2131-2136 (1996)    Article 
Target
Name:
Histidinol dehydrogenase, chloroplastic
Synonyms:
HDH Histidinol dehydrogenase
Type:
PROTEIN
Mol. Mass.:
50957.92
Organism:
Brassica oleracea var. capitata
Description:
EBI_100278
Residue:
469
  
Inhibitor
Name:
BDBM50267976
Synonyms:
(S)-3-Amino-1-biphenyl-4-yl-4-(1H-imidazol-4-yl)-butan-2-one; dihydrochloride CHEMBL483668
Type:
Small organic molecule
Emp. Form.:
C19H19N3O
Mol. Mass.:
305.3737
SMILES:
N[C@@H](Cc1cnc[nH]1)C(=O)Cc1ccc(cc1)-c1ccccc1
: