Target
Neuronal acetylcholine receptor subunit alpha-10
Ligand
BDBM50287845
Substrate
Meas. Tech.
ChEBML_143222
Ki
603±n/a nM
Citation
 Elliott, RLKopecka, HGunn, DELin, NHGarvey, DSRyther, KBHolladay, MWAnderson, DJCampbell, JESullivan, JPBuckley, MJGunther, KLO'Neill, ABDecker, MWArnerić, SP 2-(Aryloxymethyl) azacyclic analogues as novel nicotinic acetylcholine receptor (nAChR) ligands Bioorg Med Chem Lett 6:2283-2288 (1996)    Article 
Target
Name:
Neuronal acetylcholine receptor subunit alpha-10
Synonyms:
ACH10_RAT Neuronal acetylcholine receptor protein alpha-10 subunit | Nicotinic acetylcholine receptor alpha9/alpha10
Type:
PROTEIN
Mol. Mass.:
49830.54
Organism:
Rattus norvegicus
Description:
ChEMBL_143222
Residue:
447
  
Inhibitor
Name:
BDBM50287845
Synonyms:
(S)-2-(4-Chloro-phenoxymethyl)-1-methyl-pyrrolidine | CHEMBL73657
Type:
Small organic molecule
Emp. Form.:
C12H16ClNO
Mol. Mass.:
225.715
SMILES:
CN1CCC[C@H]1COc1ccc(Cl)cc1
: