Target
Neuronal acetylcholine receptor subunit alpha-10
Ligand
BDBM50287851
Substrate
Meas. Tech.
ChEBML_143222
Ki
3.1±n/a nM
Citation
 Elliott, RLKopecka, HGunn, DELin, NHGarvey, DSRyther, KBHolladay, MWAnderson, DJCampbell, JESullivan, JPBuckley, MJGunther, KLO'Neill, ABDecker, MWArnerić, SP 2-(Aryloxymethyl) azacyclic analogues as novel nicotinic acetylcholine receptor (nAChR) ligands Bioorg Med Chem Lett 6:2283-2288 (1996)    Article 
Target
Name:
Neuronal acetylcholine receptor subunit alpha-10
Synonyms:
ACH10_RAT Neuronal acetylcholine receptor protein alpha-10 subunit | Nicotinic acetylcholine receptor alpha9/alpha10
Type:
PROTEIN
Mol. Mass.:
49830.54
Organism:
Rattus norvegicus
Description:
ChEMBL_143222
Residue:
447
  
Inhibitor
Name:
BDBM50287851
Synonyms:
(S)-2-(3-Fluoro-phenoxymethyl)-azetidine | CHEMBL305674
Type:
Small organic molecule
Emp. Form.:
C10H12FNO
Mol. Mass.:
181.2068
SMILES:
Fc1cccc(OC[C@@H]2CCN2)c1
: