Target
Dihydrofolate reductase
Ligand
BDBM50288821
Substrate
Meas. Tech.
ChEBML_54278
Ki
0.120±n/a nM
Citation
 Gossett, LSHabeck, LLGates, SBAndis, SLWorzalla, JFSchultz, RMMendelsonn, LGKohler, WRatnam, MGrindey, GBShih, C Synthesis and biological evaluation of a new series of dihydrofolate reductase inhibitors based on the 4-(2,6-diamino-5-pyrimidinyl)alkyl-L-glutamic acid structure Bioorg Med Chem Lett 6:473-476 (1996)    Article 
Target
Name:
Dihydrofolate reductase
Synonyms:
DHFR Dihydrofolate reductase (DHFR) | Tetrahydrofolate dehydrogenase
Type:
Enzyme
Mol. Mass.:
21453.99
Organism:
Homo sapiens (Human)
Description:
Recombinant human DHFR.
Residue:
187
  
Inhibitor
Name:
BDBM50288821
Synonyms:
(S)-2-{(S)-4-[3-(2,4-Diamino-pyrimidin-5-yl)-propyl]-benzoylamino}-pentanedioic acid LY-316373
Type:
Small organic molecule
Emp. Form.:
C19H23N5O5
Mol. Mass.:
401.4164
SMILES:
Nc1ncc(CCCc2ccc(cc2)C(=O)N[C@@H](CCC(O)=O)C(O)=O)c(N)n1
: