Target
Sodium/glucose cotransporter 2
Ligand
BDBM20880
Substrate
Meas. Tech.
ChEMBL_617327 (CHEMBL1101142)
IC50
1.4±n/a nM
Citation
 Robinson, RPMascitti, VBoustany-Kari, CMCarr, CLFoley, PMKimoto, ELeininger, MTLowe, AKlenotic, MKMacdonald, JIMaguire, RJMasterson, VMMaurer, TSMiao, ZPatel, JDPréville, CReese, MRShe, LSteppan, CMThuma, BAZhu, T C-Aryl glycoside inhibitors of SGLT2: Exploration of sugar modifications including C-5 spirocyclization. Bioorg Med Chem Lett 20:1569-72 (2010)  
Target
Name:
Sodium/glucose cotransporter 2
Synonyms:
Na(+)/glucose cotransporter 2 SGLT2 Sodium-Dependent Glucose Cotransporter 2 (SGLT2) Solute carrier family 5 member 2
Type:
Protein
Mol. Mass.:
72902.00
Organism:
Homo sapiens (Human)
Description:
P31639
Residue:
672
  
Inhibitor
Name:
BDBM20880
Synonyms:
(2S,3R,4R,5S,6R)-2-{4-chloro-3-[(4-ethoxyphenyl)methyl]phenyl}-6-(hydroxymethyl)oxane-3,4,5-triol C-aryl glucoside, 6 Dapagliflozin
Type:
Small organic molecule
Emp. Form.:
C21H25ClO6
Mol. Mass.:
408.873
SMILES:
CCOc1ccc(Cc2cc(ccc2Cl)[C@@H]2O[C@H](CO)[C@@H](O)[C@H](O)[C@H]2O)cc1
: