Target
Peroxisome proliferator-activated receptor alpha
Ligand
BDBM50314830
Substrate
Meas. Tech.
ChEMBL_627237 (CHEMBL1110806)
IC50
513±n/a nM
Citation
 Li, JKennedy, LJShi, YTao, SYe, XYChen, SYWang, YHernández, ASWang, WDevasthale, PVChen, SLai, ZZhang, HWu, SSmirk, RABolton, SARyono, DEZhang, HLim, NKChen, BCLocke, KTO'Malley, KMZhang, LSrivastava, RAMiao, BMeyers, DSMonshizadegan, HSearch, DGrimm, DZhang, RHarrity, TKunselman, LKCap, MKadiyala, PHosagrahara, VZhang, LXu, CLi, YXMuckelbauer, JKChang, CAn, YKrystek, SRBlanar, MAZahler, RMukherjee, RCheng, PTTino, JA Discovery of an oxybenzylglycine based peroxisome proliferator activated receptor alpha selective agonist 2-((3-((2-(4-chlorophenyl)-5-methyloxazol-4-yl)methoxy)benzyl)(methoxycarbonyl)amino)acetic acid (BMS-687453). J Med Chem 53:2854-64 (2010)  
Target
Name:
Peroxisome proliferator-activated receptor alpha
Synonyms:
NR1C1 PPAR PPAR-alpha PPARA_HUMAN Peroxisome proliferator-activated receptor | Peroxisome proliferator-activated receptor alpha (PPAR alpha)
Type:
Enzyme
Mol. Mass.:
52222.08
Organism:
Homo sapiens (Human)
Description:
Q07869
Residue:
468
  
Inhibitor
Name:
BDBM50314830
Synonyms:
2-((3-((2-(4-chlorophenyl)-5-methyloxazol-4-yl)methoxy)benzyl)(cyclohexyloxycarbonyl)amino)acetic acid | CHEMBL1092235
Type:
Small organic molecule
Emp. Form.:
C27H29ClN2O6
Mol. Mass.:
512.982
SMILES:
Cc1oc(nc1COc1cccc(CN(CC(O)=O)C(=O)OC2CCCCC2)c1)-c1ccc(Cl)cc1
: