Target
Peroxisome proliferator-activated receptor gamma
Ligand
BDBM50314826
Substrate
Meas. Tech.
ChEMBL_627238 (CHEMBL1110807)
IC50
483±n/a nM
Citation
 Li, JKennedy, LJShi, YTao, SYe, XYChen, SYWang, YHernández, ASWang, WDevasthale, PVChen, SLai, ZZhang, HWu, SSmirk, RABolton, SARyono, DEZhang, HLim, NKChen, BCLocke, KTO'Malley, KMZhang, LSrivastava, RAMiao, BMeyers, DSMonshizadegan, HSearch, DGrimm, DZhang, RHarrity, TKunselman, LKCap, MKadiyala, PHosagrahara, VZhang, LXu, CLi, YXMuckelbauer, JKChang, CAn, YKrystek, SRBlanar, MAZahler, RMukherjee, RCheng, PTTino, JA Discovery of an oxybenzylglycine based peroxisome proliferator activated receptor alpha selective agonist 2-((3-((2-(4-chlorophenyl)-5-methyloxazol-4-yl)methoxy)benzyl)(methoxycarbonyl)amino)acetic acid (BMS-687453). J Med Chem 53:2854-64 (2010)  
Target
Name:
Peroxisome proliferator-activated receptor gamma
Synonyms:
NR1C3 PPAR-gamma PPARG_HUMAN Peroxisome proliferator-activated receptor gamma (PPAR gamma) Peroxisome proliferator-activated receptor gamma (PPARĪ³) peroxisome proliferator-activated receptor gamma isoform 2
Type:
Nuclear Receptor
Mol. Mass.:
57613.46
Organism:
Homo sapiens (Human)
Description:
P37231
Residue:
505
  
Inhibitor
Name:
BDBM50314826
Synonyms:
2-((3-((2-(4-tert-butylphenyl)-5-methyloxazol-4-yl)methoxy)benzyl)(ptolyloxycarbonyl)amino)acetic acid | CHEMBL1090187
Type:
Small organic molecule
Emp. Form.:
C32H34N2O6
Mol. Mass.:
542.6222
SMILES:
Cc1oc(nc1COc1cccc(CN(CC(O)=O)C(=O)Oc2ccc(C)cc2)c1)-c1ccc(cc1)C(C)(C)C
: