Target
Glutamate receptor 1
Ligand
BDBM50192229
Substrate
Meas. Tech.
ChEMBL_628114 (CHEMBL1108125)
EC50
19800±n/a nM
Citation
 Fleming, JJEngland, PM Developing a complete pharmacology for AMPA receptors: a perspective on subtype-selective ligands. Bioorg Med Chem 18:1381-7 (2010)  
Target
Name:
Glutamate receptor 1
Synonyms:
AMPA-selective glutamate receptor 1 GLUR1 GRIA1_HUMAN GluR-A Glutamate AMPA 1 Glutamate receptor AMPA 1/2 Glutamate receptor ionotropic, AMPA 1
Type:
Enzyme Catalytic Domain
Mol. Mass.:
101512.92
Organism:
Homo sapiens (Human)
Description:
Glutamate AMPA 1 GRIA1 HUMAN::P42261
Residue:
906
  
Inhibitor
Name:
BDBM50192229
Synonyms:
3-Bicyclo[2.2.1]hept-5-en-2-yl-6-chloro-1,1-dioxo-1,2,3,4-tetrahydro-1lambda*6*-benzo[1,2,4]thiadiazine-7-sulfonic acid amide 3-Bicyclo[2.2.1]hept-5-en-2-yl-7-chloro-1,1-dioxo-1,2,3,4-tetrahydro-1lambda*6*-benzo[1,2,4]thiadiazine-6-sulfonic acid amide CHEMBL61593 | CYCLOTHIAZIDE
Type:
Small organic molecule
Emp. Form.:
C14H16ClN3O4S2
Mol. Mass.:
389.878
SMILES:
NS(=O)(=O)c1cc2c(NC(NS2(=O)=O)C2CC3CC2C=C3)cc1Cl
: