Target
Fatty-acid amide hydrolase 1
Ligand
BDBM50324698
Substrate
Meas. Tech.
ChEMBL_653616 (CHEMBL1226988)
IC50
0.4±n/a nM
Citation
 Nomura, DKBlankman, JLSimon, GMFujioka, KIssa, RSWard, AMCravatt, BFCasida, JE Activation of the endocannabinoid system by organophosphorus nerve agents. Nat Chem Biol 4:373-8 (2008)  
Target
Name:
Fatty-acid amide hydrolase 1
Synonyms:
Anandamide amidohydrolase FAAH1_MOUSE Faah1 Fatty-acid amide hydrolase (FAAH) Oleamide hydrolase 1
Type:
Hydrolase; single-pass membrane protein; homodimer
Mol. Mass.:
63227.28
Organism:
Mus musculus (mouse)
Description:
Mouse brain membranes were used in the assay.
Residue:
579
  
Inhibitor
Name:
BDBM50324698
Synonyms:
CHEMBL1222256 | Ethyl octylfluorophosphonate
Type:
Small organic molecule
Emp. Form.:
C11H24FO2P
Mol. Mass.:
238.2792
SMILES:
CCCCCCCCP(F)(=O)OC(C)C
: