Target
Inhibitor of nuclear factor kappa-B kinase subunit beta
Ligand
BDBM50325367
Substrate
Meas. Tech.
ChEMBL_652133 (CHEMBL1228242)
IC50
530±n/a nM
Citation
 Shimizu, HTanaka, SToki, TYasumatsu, IAkimoto, TMorishita, KYamasaki, TYasukochi, TIimura, S Discovery of imidazo[1,2-b]pyridazine derivatives as IKKbeta inhibitors. Part 1: Hit-to-lead study and structure-activity relationship. Bioorg Med Chem Lett 20:5113-8 (2010)  
Target
Name:
Inhibitor of nuclear factor kappa-B kinase subunit beta
Synonyms:
I-kappa-B Kinase 2 (IKK-beta) I-kappa-B-kinase beta IKBKB IKK-beta IKK2/IKK1 IKKB_HUMAN Inhibitor of nuclear factor kappa B kinase beta subunit Nuclear factor NF-kappa-B inhibitor kinase beta
Type:
Serine/threonine-protein kinase
Mol. Mass.:
86554.39
Organism:
Homo sapiens (Human)
Description:
GST-tagged IKK-2 was expressed in High Five cells and purified.
Residue:
756
  
Inhibitor
Name:
BDBM50325367
Synonyms:
CHEMBL1223136 | trans-4-(6-(4-hydroxycyclohexylamino)imidazo[1,2-b]pyridazin-3-yl)-N-((S)-pyrrolidin-2-ylmethyl)benzamide
Type:
Small organic molecule
Emp. Form.:
C24H30N6O2
Mol. Mass.:
434.534
SMILES:
O[C@H]1CC[C@@H](CC1)Nc1ccc2ncc(-c3ccc(cc3)C(=O)NC[C@@H]3CCCN3)n2n1
: