Target
Inhibitor of nuclear factor kappa-B kinase subunit beta
Ligand
BDBM50325368
Substrate
Meas. Tech.
ChEMBL_652133 (CHEMBL1228242)
IC50
190±n/a nM
Citation
 Shimizu, HTanaka, SToki, TYasumatsu, IAkimoto, TMorishita, KYamasaki, TYasukochi, TIimura, S Discovery of imidazo[1,2-b]pyridazine derivatives as IKKbeta inhibitors. Part 1: Hit-to-lead study and structure-activity relationship. Bioorg Med Chem Lett 20:5113-8 (2010)  
Target
Name:
Inhibitor of nuclear factor kappa-B kinase subunit beta
Synonyms:
I-kappa-B Kinase 2 (IKK-beta) I-kappa-B-kinase beta IKBKB IKK-beta IKK2/IKK1 IKKB_HUMAN Inhibitor of nuclear factor kappa B kinase beta subunit Nuclear factor NF-kappa-B inhibitor kinase beta
Type:
Serine/threonine-protein kinase
Mol. Mass.:
86554.39
Organism:
Homo sapiens (Human)
Description:
GST-tagged IKK-2 was expressed in High Five cells and purified.
Residue:
756
  
Inhibitor
Name:
BDBM50325368
Synonyms:
(S)-4-(6-(3-chlorobenzylamino)imidazo[1,2-b]pyridazin-3-yl)-N-(pyrrolidin-2-ylmethyl)benzamide | CHEMBL1222992
Type:
Small organic molecule
Emp. Form.:
C25H25ClN6O
Mol. Mass.:
460.959
SMILES:
Clc1cccc(CNc2ccc3ncc(-c4ccc(cc4)C(=O)NC[C@@H]4CCCN4)n3n2)c1
: