Target
Inhibitor of nuclear factor kappa-B kinase subunit beta
Ligand
BDBM50325369
Substrate
Meas. Tech.
ChEMBL_652133 (CHEMBL1228242)
IC50
200±n/a nM
Citation
 Shimizu, HTanaka, SToki, TYasumatsu, IAkimoto, TMorishita, KYamasaki, TYasukochi, TIimura, S Discovery of imidazo[1,2-b]pyridazine derivatives as IKKbeta inhibitors. Part 1: Hit-to-lead study and structure-activity relationship. Bioorg Med Chem Lett 20:5113-8 (2010)  
Target
Name:
Inhibitor of nuclear factor kappa-B kinase subunit beta
Synonyms:
I-kappa-B Kinase 2 (IKK-beta) I-kappa-B-kinase beta IKBKB IKK-beta IKK2/IKK1 IKKB_HUMAN Inhibitor of nuclear factor kappa B kinase beta subunit Nuclear factor NF-kappa-B inhibitor kinase beta
Type:
Serine/threonine-protein kinase
Mol. Mass.:
86554.39
Organism:
Homo sapiens (Human)
Description:
GST-tagged IKK-2 was expressed in High Five cells and purified.
Residue:
756
  
Inhibitor
Name:
BDBM50325369
Synonyms:
4-(6-(cyclopropylmethylamino)imidazo[1,2-b]pyridazin-3-yl)-N-(2-(dimethylamino)ethyl)benzamide | CHEMBL1223203
Type:
Small organic molecule
Emp. Form.:
C21H26N6O
Mol. Mass.:
378.4707
SMILES:
CN(C)CCNC(=O)c1ccc(cc1)-c1cnc2ccc(NCC3CC3)nn12
: