Target
Serine/threonine-protein kinase pim-3
Ligand
BDBM50326440
Substrate
Meas. Tech.
ChEMBL_657899 (CHEMBL1248423)
IC50
60±n/a nM
Citation
 Akué-Gédu, RNauton, LThéry, VBain, JCohen, PAnizon, FMoreau, P Synthesis, Pim kinase inhibitory potencies and in vitro antiproliferative activities of diversely substituted pyrrolo[2,3-a]carbazoles. Bioorg Med Chem 18:6865-73 (2010)  
Target
Name:
Serine/threonine-protein kinase pim-3
Synonyms:
PIM3 Serine/threonine-protein kinase pim-3 (PIM3)
Type:
Protein
Mol. Mass.:
35888.19
Organism:
Homo sapiens (Human)
Description:
Q86V86
Residue:
326
  
Inhibitor
Name:
BDBM50326440
Synonyms:
9-Ethyl-1,10-dihydropyrrolo[2,3-a]carbazole-3-carbaldehyde | CHEMBL1241011
Type:
Small organic molecule
Emp. Form.:
C17H14N2O
Mol. Mass.:
262.3059
SMILES:
CCc1cccc2c1[nH]c1c2ccc2c(C=O)c[nH]c12
: