Target
E3 ubiquitin-protein ligase Mdm2
Ligand
BDBM50327206
Substrate
Meas. Tech.
ChEMBL_664227 (CHEMBL1261734)
Kd
75±n/a nM
Citation
 Datta, SBucks, MEKoley, DLim, PXSavinov, SN Functional profiling of p53-binding sites in Hdm2 and Hdmx using a genetic selection system. Bioorg Med Chem 18:6099-108 (2010)  
Target
Name:
E3 ubiquitin-protein ligase Mdm2
Synonyms:
Double minute 2 protein E3 ubiquitin-protein ligase Mdm2 (p53-binding protein Mdm2) Human Double Minute 2 (HDM2) MDM2-MDMX p53-Binding Protein MDM2 | p53-binding protein
Type:
Oncoprotein
Mol. Mass.:
55196.54
Organism:
Homo sapiens (Human)
Description:
Q00987
Residue:
491
  
Inhibitor
Name:
BDBM50327206
Synonyms:
(2S,5S,8S,11S,14S,17S,20S,23S,26S,29S)-11-((1H-indol-3-yl)methyl)-29-amino-8-(4-aminobutyl)-23-benzyl-17-(carboxymethyl)-26-((R)-1-hydroxyethyl)-20-(hydroxymethyl)-2,5,14-triisobutyl-4,7,10,13,16,19,22,25,28-nonaoxo-3,6,9,12,15,18,21,24,27-nonaazadotriacontane-1,32-dioic acid | CHEMBL1256072
Type:
Small organic molecule
Emp. Form.:
C60H90N12O17
Mol. Mass.:
1251.4268
SMILES:
CC(C)C[C@H](NC(=O)[C@H](CC(C)C)NC(=O)[C@H](CCCCN)NC(=O)[C@H](Cc1c[nH]c2ccccc12)NC(=O)[C@H](CC(C)C)NC(=O)[C@H](CC(O)=O)NC(=O)[C@H](CO)NC(=O)[C@H](Cc1ccccc1)NC(=O)[C@@H](NC(=O)[C@@H](N)CCC(O)=O)[C@@H](C)O)C(O)=O
: