Target
Glutamate receptor 1
Ligand
BDBM50330411
Substrate
Meas. Tech.
ChEMBL_684654 (CHEMBL1285621)
EC50
21000±n/a nM
Citation
 Grove, SJJamieson, CMaclean, JKMorrow, JARankovic, Z Positive allosteric modulators of thea-amino-3-hydroxy-5-methyl-4-isoxazolepropionic acid (AMPA) receptor. J Med Chem 53:7271-9 (2010)  
Target
Name:
Glutamate receptor 1
Synonyms:
AMPA-selective glutamate receptor 1 GLUR1 GRIA1_HUMAN GluR-A Glutamate AMPA 1 Glutamate receptor AMPA 1/2 Glutamate receptor ionotropic, AMPA 1
Type:
Enzyme Catalytic Domain
Mol. Mass.:
101512.92
Organism:
Homo sapiens (Human)
Description:
Glutamate AMPA 1 GRIA1 HUMAN::P42261
Residue:
906
  
Inhibitor
Name:
BDBM50330411
Synonyms:
1,2,3,7,8,11a-Hexahydro-6,9,11-trioxa-3a-aza-cyclopenta[b]anthracen-4-one Pyrrolidino-1,3-oxazinobenzo-1,4-dioxan-10-one
Type:
Small organic molecule
Emp. Form.:
C13H13NO4
Mol. Mass.:
247.2466
SMILES:
O=C1N2CCCC2Oc2cc3OCCOc3cc12
: