Target
Glutamate receptor 1
Ligand
BDBM50330419
Substrate
Meas. Tech.
ChEMBL_684654 (CHEMBL1285621)
EC50
660±n/a nM
Citation
 Grove, SJJamieson, CMaclean, JKMorrow, JARankovic, Z Positive allosteric modulators of thea-amino-3-hydroxy-5-methyl-4-isoxazolepropionic acid (AMPA) receptor. J Med Chem 53:7271-9 (2010)  
Target
Name:
Glutamate receptor 1
Synonyms:
AMPA-selective glutamate receptor 1 GLUR1 GRIA1_HUMAN GluR-A Glutamate AMPA 1 Glutamate receptor AMPA 1/2 Glutamate receptor ionotropic, AMPA 1
Type:
Enzyme Catalytic Domain
Mol. Mass.:
101512.92
Organism:
Homo sapiens (Human)
Description:
Glutamate AMPA 1 GRIA1 HUMAN::P42261
Residue:
906
  
Inhibitor
Name:
BDBM50330419
Synonyms:
CHEMBL1277095 | N,N'-(nonane-1,9-diyl)dipropane-2-sulfonamide
Type:
Small organic molecule
Emp. Form.:
C15H34N2O4S2
Mol. Mass.:
370.571
SMILES:
CC(C)S(=O)(=O)NCCCCCCCCCNS(=O)(=O)C(C)C
: