Target
Prostaglandin G/H synthase 1
Ligand
BDBM13065
Substrate
Meas. Tech.
ChEMBL_715580 (CHEMBL1663396)
IC50
7.8±n/a nM
Citation
 Pontiki, EHadjipavlou-Litina, DLitinas, KNicolotti, OCarotti, A Design, synthesis and pharmacobiological evaluation of novel acrylic acid derivatives acting as lipoxygenase and cyclooxygenase-1 inhibitors with antioxidant and anti-inflammatory activities. Eur J Med Chem 46:191-200 (2010)  
Target
Name:
Prostaglandin G/H synthase 1
Synonyms:
COX-1 Cyclooxygenase Cyclooxygenase-1 (COX-1) PTGS1 | Prostaglandin G/H synthase (cyclooxygenase)
Type:
Enzyme
Mol. Mass.:
68692.62
Organism:
Homo sapiens (Human)
Description:
P23219
Residue:
599
  
Inhibitor
Name:
BDBM13065
Synonyms:
5-(4-chlorophenyl)-1-(4-methoxyphenyl)-3-(trifluoromethyl)-1H-pyrazole SC-560
Type:
Small organic molecule
Emp. Form.:
C17H12ClF3N2O
Mol. Mass.:
352.738
SMILES:
COc1ccc(cc1)-n1nc(cc1-c1ccc(Cl)cc1)C(F)(F)F
: