Target
Hydroxycarboxylic acid receptor 2
Ligand
BDBM23515
Substrate
Meas. Tech.
ChEMBL_718725 (CHEMBL1680944)
EC50
100±n/a nM
Citation
 Qin, JRao, AChen, XZhu, XLiu, ZHuang, XDegrado, SHuang, YXiao, DAslanian, RCheewatrakoolpong, BZhang, HGreenfeder, SFarley, CCook, JKurowski, SLi, QHeek, MvChintala, MWang, GHsieh, YLi, F Discovery of a Potent Nicotinic Acid Receptor Agonist for the Treatment of Dyslipidemia ACS Med Chem Lett 2:171-176 (2011)  
Target
Name:
Hydroxycarboxylic acid receptor 2
Synonyms:
G-protein coupled receptor 109A GPR109A HCAR2 HM74A NIACR1 Nicotinic acid receptor 1
Type:
G Protein-Coupled Receptor (GPCR)
Mol. Mass.:
41868.22
Organism:
Homo sapiens (Human)
Description:
Membranes from CHO cells expressing the recombinant human GPR109A were used in competition binding assay.
Residue:
363
  
Inhibitor
Name:
BDBM23515
Synonyms:
CHEMBL573 Nicotinic Acid pyridine-3-carboxylic acid | wampocap
Type:
Small organic molecule
Emp. Form.:
C6H5NO2
Mol. Mass.:
123.1094
SMILES:
OC(=O)c1cccnc1
: