Target
Aurora kinase A
Ligand
BDBM50344664
Substrate
Meas. Tech.
ChEMBL_748994 (CHEMBL1781779)
IC50
>50000±n/a nM
Citation
 Kinoshita, KOno, YEmura, TAsoh, KFuruichi, NIto, TKawada, HTanaka, SMorikami, KTsukaguchi, TSakamoto, HTsukuda, TOikawa, N Discovery of novel tetracyclic compounds as anaplastic lymphoma kinase inhibitors. Bioorg Med Chem Lett 21:3788-93 (2011)  
Target
Name:
Aurora kinase A
Synonyms:
AIK ARK-1 AURA AURKA_HUMAN Aurora 2 Aurora kinase A (AURKA) Aurora kinase A (Aurora-2) Aurora/IPL1-related kinase 1 Breast tumor-amplified kinase IAK1 STK15 GN Serine/threonine kinase 15 Serine/threonine-protein kinase 6 Serine/threonine-protein kinase aurora-A aurora-2 | hARK1
Type:
Serine/threonine-protein kinase
Mol. Mass.:
45830.98
Organism:
Homo sapiens (Human)
Description:
O14965
Residue:
403
  
Inhibitor
Name:
BDBM50344664
Synonyms:
6,6-dimethyl-8-(1-(oxetan-3-yl)piperidin-4-yl)-11-oxo-6,11-dihydro-5H-benzo[b]carbazole-3-carbonitrile US9126931, 178
Type:
Small organic molecule
Emp. Form.:
C27H27N3O2
Mol. Mass.:
425.5222
SMILES:
CC1(C)c2[nH]c3cc(ccc3c2C(=O)c2ccc(cc12)C1CCN(CC1)C1COC1)C#N
: