Target
Protein kinase C beta type
Ligand
BDBM50344664
Substrate
Meas. Tech.
ChEMBL_748996 (CHEMBL1781781)
IC50
>50000±n/a nM
Citation
 Kinoshita, KOno, YEmura, TAsoh, KFuruichi, NIto, TKawada, HTanaka, SMorikami, KTsukaguchi, TSakamoto, HTsukuda, TOikawa, N Discovery of novel tetracyclic compounds as anaplastic lymphoma kinase inhibitors. Bioorg Med Chem Lett 21:3788-93 (2011)  
Target
Name:
Protein kinase C beta type
Synonyms:
KPCB_HUMAN PKC beta PKCB PRKCB1 Protein kinase C beta type | Protein kinase C beta type II (PRKCB2)
Type:
Enzyme
Mol. Mass.:
76873.67
Organism:
Homo sapiens (Human)
Description:
The recombinant human PKC enzymes were produced using a baculovirus expression system in SF9 cells
Residue:
671
  
Inhibitor
Name:
BDBM50344664
Synonyms:
6,6-dimethyl-8-(1-(oxetan-3-yl)piperidin-4-yl)-11-oxo-6,11-dihydro-5H-benzo[b]carbazole-3-carbonitrile US9126931, 178
Type:
Small organic molecule
Emp. Form.:
C27H27N3O2
Mol. Mass.:
425.5222
SMILES:
CC1(C)c2[nH]c3cc(ccc3c2C(=O)c2ccc(cc12)C1CCN(CC1)C1COC1)C#N
: