Target
Programmed cell death protein 4
Ligand
BDBM50345541
Substrate
Meas. Tech.
ChEMBL_751484 (CHEMBL1787264)
EC50
3000±n/a nM
Citation
 Grkovic, TBlees, JSColburn, NHSchmid, TThomas, CLHenrich, CJMcMahon, JBGustafson, KR Cryptocaryols A-H,a-pyrone-containing 1,3-polyols from Cryptocarya sp. implicated in stabilizing the tumor suppressor Pdcd4. J Nat Prod 74:1015-20 (2011)  
Target
Name:
Programmed cell death protein 4
Synonyms:
H731 Nuclear antigen H731-like PDCD4_HUMAN | Protein 197/15a
Type:
PROTEIN
Mol. Mass.:
51720.55
Organism:
Homo sapiens (Human)
Description:
ChEMBL_776474
Residue:
469
  
Inhibitor
Name:
BDBM50345541
Synonyms:
CHEMBL1784373 | Cryptocaryol B
Type:
Small organic molecule
Emp. Form.:
C32H58O8
Mol. Mass.:
570.7981
SMILES:
CCCCCCCCCCCCCCC[C@H](C[C@H](O)C[C@H](O)C[C@H](O)C[C@H](O)C[C@H]1CC=CC(=O)O1)OC(C)=O
: