Target
5-hydroxytryptamine receptor 1A
Ligand
BDBM50126474
Substrate
Meas. Tech.
ChEMBL_750527 (CHEMBL1786288)
Ki
2.4±n/a nM
Citation
 Alonso, DVázquez-Villa, HGamo, AMMartínez-Esperón, MFTortosa, MViso, AFernández de la Pradilla, RJunquera, EAicart, EMartín-Fontecha, MBenhamú, BLópez-Rodríguez, MLOrtega-Gutiérrez, S Development of Fluorescent Ligands for the Human 5-HT1A Receptor. ACS Med Chem Lett 1:249-253 (2010)  
Target
Name:
5-hydroxytryptamine receptor 1A
Synonyms:
5-HT-1A 5-hydroxytryptamine receptor 1A (5-HT-1A) ADRB2RL1 Dopamine D2 receptor and serotonin 1a receptor HTR1A | Serotonin receptor 1A
Type:
Mol. Mass.:
46122.49
Organism:
Homo sapiens (Human)
Description:
Residue:
422
  
Inhibitor
Name:
BDBM50126474
Synonyms:
2-[4-(4-Naphthalen-1-yl-piperazin-1-yl)-butyl]-tetrahydro-pyrrolo[1,2-c]imidazole-1,3-dione | CHEMBL33150
Type:
Small organic molecule
Emp. Form.:
C24H30N4O2
Mol. Mass.:
406.5206
SMILES:
Oc1c2CCCn2c(=O)n1CCCCN1CCN(CC1)c1cccc2ccccc12
: