Target
Lactoylglutathione lyase
Ligand
BDBM50022271
Substrate
Meas. Tech.
ChEMBL_754309 (CHEMBL1799085)
Ki
843100±n/a nM
Citation
 Liu, MYuan, MLi, ZCheng, YKLuo, HBHu, X Structural investigation into the inhibitory mechanisms of indomethacin and its analogues towards human glyoxalase I. Bioorg Med Chem Lett 21:4243-7 (2011)  
Target
Name:
Lactoylglutathione lyase
Synonyms:
Aldoketomutase Glx I Glyoxalase I LGUL_HUMAN S-D-lactoylglutathione methylglyoxal lyase
Type:
Enzyme
Mol. Mass.:
20772.95
Organism:
Homo sapiens (Human)
Description:
Q04760
Residue:
184
  
Inhibitor
Name:
BDBM50022271
Synonyms:
2-(3-Benzoylphenyl)propionic acid 3-Benzoyl-alpha-methylbenzeneacetic acid CHEMBL571 KETOPROFEN Orudis (TN) | m-Benzoylhydratropic acid
Type:
Small organic molecule
Emp. Form.:
C16H14O3
Mol. Mass.:
254.2806
SMILES:
CC(C(O)=O)c1cccc(c1)C(=O)c1ccccc1
: