Target
Potassium voltage-gated channel subfamily H member 2
Ligand
BDBM31147
Substrate
Meas. Tech.
ChEMBL_769927 (CHEMBL1832111)
IC50
>10000±n/a nM
Citation
 Lange, JHVenhorst, Jvan Dongen, MJFrankena, JBassissi, Fde Bruin, NMden Besten, Cde Beer, SBOostenbrink, CMarkova, NKruse, CG Biophysical and physicochemical methods differentiate highly ligand-efficient human D-amino acid oxidase inhibitors. Eur J Med Chem 46:4808-19 (2011)  
Target
Name:
Potassium voltage-gated channel subfamily H member 2
Synonyms:
1,3-beta-glucan synthase component GLS2 ERG Eag-related protein 1 Ether-a-go-go-related gene (HERG) Ether-a-go-go-related gene potassium channel 1 Ether-a-go-go-related gene potassium channel 1 (hERG1) Ether-a-go-go-related protein 1 H-ERG KCNH2 Potassium voltage-gated channel subfamily H member 2 (hERG) Voltage-gated potassium channel subunit Kv11.1 hERG Potassium Channel 1 | putative potassium channel subunit
Type:
Multi-pass membrane protein
Mol. Mass.:
126672.65
Organism:
Homo sapiens (Human)
Description:
Q12809
Residue:
1159
  
Inhibitor
Name:
BDBM31147
Synonyms:
4H-furo[3,2-b]pyrrole-5-carboxylic acid CHEMBL492591
Type:
Small organic molecule
Emp. Form.:
C7H5NO3
Mol. Mass.:
151.1195
SMILES:
OC(=O)c1cc2occc2[nH]1
: