Target
Heat shock protein HSP 90-alpha
Ligand
BDBM50362221
Substrate
Meas. Tech.
ChEMBL_798461 (CHEMBL1944310)
Kd
0.8±n/a nM
Citation
 Suda, AKoyano, HHayase, THada, KKawasaki, KKomiyama, SHasegawa, KFukami, TASato, SMiura, TOno, NYamazaki, TSaitoh, RShimma, NShiratori, YTsukuda, T Design and synthesis of novel macrocyclic 2-amino-6-arylpyrimidine Hsp90 inhibitors. Bioorg Med Chem Lett 22:1136-41 (2012)  
Target
Name:
Heat shock protein HSP 90-alpha
Synonyms:
HS90A_HUMAN HSP86 HSP90AA1 HSPCA Heat shock 86 kDa Heat shock protein HSP 90-alpha (HSP90) LAP-2 Lipopolysaccharide-associated protein 2 heat shock protein 90kDa alpha (cytosolic), class A member 1 isoform 2
Type:
Molecular Chaperone
Mol. Mass.:
84623.45
Organism:
Homo sapiens (Human)
Description:
P07900
Residue:
732
  
Inhibitor
Name:
BDBM50362221
Synonyms:
CHEMBL1939385
Type:
Small organic molecule
Emp. Form.:
C18H21N5O3S
Mol. Mass.:
387.456
SMILES:
Cc1cc(C)c2cc1-c1cc(SCCOC(=O)NCCNC2=O)nc(N)n1
: