Target
Nitric oxide synthase, brain
Ligand
BDBM50366041
Substrate
Meas. Tech.
ChEMBL_807735 (CHEMBL1959863)
Ki
410±n/a nM
Citation
 Labby, KJXue, FKraus, JMJi, HMataka, JLi, HMartásek, PRoman, LJPoulos, TLSilverman, RB Intramolecular hydrogen bonding: a potential strategy for more bioavailable inhibitors of neuronal nitric oxide synthase. Bioorg Med Chem 20:2435-43 (2012)  
Target
Name:
Nitric oxide synthase, brain
Synonyms:
Bnos NC-NOS NOS type I nNOS Neuronal nitric oxide synthase Nitric Oxide Synthase, brain Nitric oxide synthase, brain (nNOS) Nitric-oxide synthase, brain (nNOS) Nos1 | Peptidyl-cysteine S-nitrosylase NOS1
Type:
Enzyme
Mol. Mass.:
160570.98
Organism:
Rattus norvegicus (rat)
Description:
Recombinant nNOS overexpressed in E. coli was used in enzyme assays.
Residue:
1429
  
Inhibitor
Name:
BDBM50366041
Synonyms:
CHEMBL1956738 | US8927730, 3a
Type:
Small organic molecule
Emp. Form.:
C20H27FN4O
Mol. Mass.:
358.453
SMILES:
Cc1cc(N)nc(C[C@H]2CNC[C@H]2OCCNCc2ccccc2F)c1
: