Target
Renin
Ligand
BDBM50281636
Substrate
Meas. Tech.
ChEBML_196257
Ki
212±n/a nM
Citation
 Sawyer, TFisher, JHester, JSmith, CTomasselli, ATarpley, WBurton, PHui, JMcQuade, TConradi, RBradford, VLiu, LKinner, JTustin, JAlexander, DHarrison, AEmmert, DStaples, DMaggiora, LZhang, YPoorman, RDunna, BRao, CScarborough, PLowther, WCraik, CDeCamp, DMoon, JHowe, WHeinrikson, R Peptidomimetic inhibitors of human immunodeficiency virus protease (HIV-PR): Design, enzyme binding and selectivity, antiviral efficacy, and cell permeability properties Bioorg Med Chem Lett 3:819-824 (1993)    Article 
Target
Name:
Renin
Synonyms:
Angiotensinogenase RENI_HUMAN
Type:
Enzyme
Mol. Mass.:
45058.99
Organism:
Homo sapiens (Human)
Description:
Residue:
406
  
Inhibitor
Name:
BDBM50281636
Synonyms:
(S)-N*1*-((1S,2S,4S)-1-Cyclohexylmethyl-2-hydroxy-5-methyl-4-{(S)-2-methyl-1-[(pyridin-2-ylmethyl)-carbamoyl]-butylcarbamoyl}-hexyl)-2-[(quinoline-2-carbonyl)-amino]-succinamide | CHEMBL167514
Type:
Small organic molecule
Emp. Form.:
C41H57N7O6
Mol. Mass.:
743.9346
SMILES:
CCC(C)[C@H](NC(=O)[C@@H](C[C@H](O)[C@H](CC1CCCCC1)NC(=O)[C@H](CC(N)=O)NC(=O)c1ccc2ccccc2n1)C(C)C)C(=O)NCc1ccccn1
: