Target
Prothrombin
Ligand
BDBM50090222
Substrate
Meas. Tech.
ChEBML_208894
Ki
28±n/a nM
Citation
 Baettig, UBrown, LBrundish, DDell, CFurzer, AGarman, SJanus, DKane, PDSmith, GWalker, CVCockcroft, XAmbler, JMitchelson, ATalbot, MDTweed, MWills, N The design and synthesis of thrombin inhibitors: analogues of MD805 containing non-polar surrogates for arginine at the P1 position. Bioorg Med Chem Lett 10:1563-6 (2000)  
Target
Name:
Prothrombin
Synonyms:
Activation peptide fragment 1 Coagulation factor II Prothrombin precursor Thrombin heavy chain | Thrombin light chain
Type:
Protein
Mol. Mass.:
70029.57
Organism:
Homo sapiens (Human)
Description:
P00734
Residue:
622
  
Inhibitor
Name:
BDBM50090222
Synonyms:
CHEMBL39086 | MD805 Analogue
Type:
Small organic molecule
Emp. Form.:
C28H35FN4O3S2
Mol. Mass.:
558.731
SMILES:
CC1(C)CNc2c(C1)cccc2S(=O)(=O)NC(Cc1nc2ccccc2s1)C(=O)N1CCC(CCF)CC1
: