Target
Chymotrypsin-C
Ligand
BDBM50366642
Substrate
Meas. Tech.
ChEBML_197814
Ki
384000±n/a nM
Citation
 Baettig, UBrown, LBrundish, DDell, CFurzer, AGarman, SJanus, DKane, PDSmith, GWalker, CVCockcroft, XAmbler, JMitchelson, ATalbot, MDTweed, MWills, N The design and synthesis of thrombin inhibitors: analogues of MD805 containing non-polar surrogates for arginine at the P1 position. Bioorg Med Chem Lett 10:1563-6 (2000)  
Target
Name:
Chymotrypsin-C
Synonyms:
CLCR CTRC_HUMAN Chymotrypsin Chymotrypsin-C
Type:
Enzyme
Mol. Mass.:
29487.98
Organism:
Homo sapiens (Human)
Description:
Q99895
Residue:
268
  
Inhibitor
Name:
BDBM50366642
Synonyms:
CHEMBL1907779
Type:
Small organic molecule
Emp. Form.:
C24H40N4O4S2
Mol. Mass.:
512.729
SMILES:
CC1(C)CNc2c(C1)cccc2S(=O)(=O)N[C@@H](CSCCCN)C(=O)N1CCC(CCO)CC1
: