Target
Prothrombin
Ligand
BDBM50090249
Substrate
Meas. Tech.
ChEBML_208894
Ki
6±n/a nM
Citation
 Baettig, UBrown, LBrundish, DDell, CFurzer, AGarman, SJanus, DKane, PDSmith, GWalker, CVCockcroft, XAmbler, JMitchelson, ATalbot, MDTweed, MWills, N The design and synthesis of thrombin inhibitors: analogues of MD805 containing non-polar surrogates for arginine at the P1 position. Bioorg Med Chem Lett 10:1563-6 (2000)  
Target
Name:
Prothrombin
Synonyms:
Activation peptide fragment 1 Coagulation factor II Prothrombin precursor Thrombin heavy chain | Thrombin light chain
Type:
Protein
Mol. Mass.:
70029.57
Organism:
Homo sapiens (Human)
Description:
P00734
Residue:
622
  
Inhibitor
Name:
BDBM50090249
Synonyms:
3,3-Dimethyl-1,2,3,4-tetrahydro-quinoline-8-sulfonic acid {(S)-1-[4-(2-fluoro-ethyl)-piperidine-1-carbonyl]-4-guanidino-butyl}-amide | CHEMBL416600
Type:
Small organic molecule
Emp. Form.:
C24H39FN6O3S
Mol. Mass.:
510.668
SMILES:
CC1(C)CNc2c(C1)cccc2S(=O)(=O)N[C@@H](CCCNC(N)=N)C(=O)N1CCC(CCF)CC1
: