Target
Prothrombin
Ligand
BDBM50090235
Substrate
Meas. Tech.
ChEBML_208894
Ki
760±n/a nM
Citation
 Baettig, UBrown, LBrundish, DDell, CFurzer, AGarman, SJanus, DKane, PDSmith, GWalker, CVCockcroft, XAmbler, JMitchelson, ATalbot, MDTweed, MWills, N The design and synthesis of thrombin inhibitors: analogues of MD805 containing non-polar surrogates for arginine at the P1 position. Bioorg Med Chem Lett 10:1563-6 (2000)  
Target
Name:
Prothrombin
Synonyms:
Activation peptide fragment 1 Coagulation factor II Prothrombin precursor Thrombin heavy chain | Thrombin light chain
Type:
Protein
Mol. Mass.:
70029.57
Organism:
Homo sapiens (Human)
Description:
P00734
Residue:
622
  
Inhibitor
Name:
BDBM50090235
Synonyms:
CHEMBL38907 | MD805 Analogue
Type:
Small organic molecule
Emp. Form.:
C25H37N5O4S2
Mol. Mass.:
535.722
SMILES:
CC1(C)CNc2c(C1)cccc2S(=O)(=O)NC(Cc1nc(CN)cs1)C(=O)N1CCC(CCO)CC1
: