Target
Prothrombin
Ligand
BDBM50090236
Substrate
Meas. Tech.
ChEBML_208894
Ki
452±n/a nM
Citation
 Baettig, UBrown, LBrundish, DDell, CFurzer, AGarman, SJanus, DKane, PDSmith, GWalker, CVCockcroft, XAmbler, JMitchelson, ATalbot, MDTweed, MWills, N The design and synthesis of thrombin inhibitors: analogues of MD805 containing non-polar surrogates for arginine at the P1 position. Bioorg Med Chem Lett 10:1563-6 (2000)  
Target
Name:
Prothrombin
Synonyms:
Activation peptide fragment 1 Coagulation factor II Prothrombin precursor Thrombin heavy chain | Thrombin light chain
Type:
Protein
Mol. Mass.:
70029.57
Organism:
Homo sapiens (Human)
Description:
P00734
Residue:
622
  
Inhibitor
Name:
BDBM50090236
Synonyms:
CHEMBL418248 | MD805 Analogue
Type:
Small organic molecule
Emp. Form.:
C30H39N5O5S
Mol. Mass.:
581.726
SMILES:
CC(=O)OCCC1CCN(CC1)C(=O)C(Cc1nc2ccccc2[nH]1)NS(=O)(=O)c1cccc2CC(C)(C)CNc12
: