Target
Plasminogen
Ligand
BDBM50090231
Substrate
Meas. Tech.
ChEBML_155423
Ki
240000±n/a nM
Citation
 Baettig, UBrown, LBrundish, DDell, CFurzer, AGarman, SJanus, DKane, PDSmith, GWalker, CVCockcroft, XAmbler, JMitchelson, ATalbot, MDTweed, MWills, N The design and synthesis of thrombin inhibitors: analogues of MD805 containing non-polar surrogates for arginine at the P1 position. Bioorg Med Chem Lett 10:1563-6 (2000)  
Target
Name:
Plasminogen
Synonyms:
Activation peptide PLG Plasmin Plasmin heavy chain A, short form | Plasmin light chain B
Type:
Enzyme
Mol. Mass.:
90579.18
Organism:
Homo sapiens (Human)
Description:
Residue:
810
  
Inhibitor
Name:
BDBM50090231
Synonyms:
CHEMBL39375 | MD805 Analogue
Type:
Small organic molecule
Emp. Form.:
C28H36N4O3S2
Mol. Mass.:
540.74
SMILES:
CCC1CCN(CC1)C(=O)C(Cc1nc2ccccc2s1)NS(=O)(=O)c1cccc2CC(C)(C)CNc12
: