Target
Plasminogen
Ligand
BDBM50366643
Substrate
Meas. Tech.
ChEBML_155423
Ki
4000±n/a nM
Citation
 Baettig, UBrown, LBrundish, DDell, CFurzer, AGarman, SJanus, DKane, PDSmith, GWalker, CVCockcroft, XAmbler, JMitchelson, ATalbot, MDTweed, MWills, N The design and synthesis of thrombin inhibitors: analogues of MD805 containing non-polar surrogates for arginine at the P1 position. Bioorg Med Chem Lett 10:1563-6 (2000)  
Target
Name:
Plasminogen
Synonyms:
Activation peptide PLG Plasmin Plasmin heavy chain A, short form | Plasmin light chain B
Type:
Enzyme
Mol. Mass.:
90579.18
Organism:
Homo sapiens (Human)
Description:
Residue:
810
  
Inhibitor
Name:
BDBM50366643
Synonyms:
CHEMBL1907778
Type:
Small organic molecule
Emp. Form.:
C24H39FN4O3S2
Mol. Mass.:
514.72
SMILES:
CC1(C)CNc2c(C1)cccc2S(=O)(=O)N[C@@H](CSCCCN)C(=O)N1CCC(CCF)CC1
: