Target
Coagulation factor X
Ligand
BDBM50366643
Substrate
Meas. Tech.
ChEBML_48993
Ki
87000±n/a nM
Citation
 Baettig, UBrown, LBrundish, DDell, CFurzer, AGarman, SJanus, DKane, PDSmith, GWalker, CVCockcroft, XAmbler, JMitchelson, ATalbot, MDTweed, MWills, N The design and synthesis of thrombin inhibitors: analogues of MD805 containing non-polar surrogates for arginine at the P1 position. Bioorg Med Chem Lett 10:1563-6 (2000)  
Target
Name:
Coagulation factor X
Synonyms:
Activated coagulation factor X (FXa) Coagulation factor X precursor F10 Factor X heavy chain Factor Xa Stuart-Prower factor
Type:
Enzyme
Mol. Mass.:
54726.60
Organism:
Homo sapiens (Human)
Description:
Residue:
488
  
Inhibitor
Name:
BDBM50366643
Synonyms:
CHEMBL1907778
Type:
Small organic molecule
Emp. Form.:
C24H39FN4O3S2
Mol. Mass.:
514.72
SMILES:
CC1(C)CNc2c(C1)cccc2S(=O)(=O)N[C@@H](CSCCCN)C(=O)N1CCC(CCF)CC1
: