Target
Chymotrypsin-C
Ligand
BDBM50090226
Substrate
Meas. Tech.
ChEBML_197814
Ki
7550±n/a nM
Citation
 Baettig, UBrown, LBrundish, DDell, CFurzer, AGarman, SJanus, DKane, PDSmith, GWalker, CVCockcroft, XAmbler, JMitchelson, ATalbot, MDTweed, MWills, N The design and synthesis of thrombin inhibitors: analogues of MD805 containing non-polar surrogates for arginine at the P1 position. Bioorg Med Chem Lett 10:1563-6 (2000)  
Target
Name:
Chymotrypsin-C
Synonyms:
CLCR CTRC_HUMAN Chymotrypsin Chymotrypsin-C
Type:
Enzyme
Mol. Mass.:
29487.98
Organism:
Homo sapiens (Human)
Description:
Q99895
Residue:
268
  
Inhibitor
Name:
BDBM50090226
Synonyms:
3-Methyl-1,2,3,4-tetrahydro-quinoline-8-sulfonic acid {(S)-1-benzothiazol-2-ylmethyl-2-[4-(2-hydroxy-ethyl)-piperidin-1-yl]-2-oxo-ethyl}-amide MD805 Analogue
Type:
Small organic molecule
Emp. Form.:
C27H34N4O4S2
Mol. Mass.:
542.713
SMILES:
CC1CNc2c(C1)cccc2S(=O)(=O)N[C@@H](Cc1nc2ccccc2s1)C(=O)N1CCC(CCO)CC1
: