Target
Coagulation factor X
Ligand
BDBM50090231
Substrate
Meas. Tech.
ChEBML_48993
Ki
92000±n/a nM
Citation
 Baettig, UBrown, LBrundish, DDell, CFurzer, AGarman, SJanus, DKane, PDSmith, GWalker, CVCockcroft, XAmbler, JMitchelson, ATalbot, MDTweed, MWills, N The design and synthesis of thrombin inhibitors: analogues of MD805 containing non-polar surrogates for arginine at the P1 position. Bioorg Med Chem Lett 10:1563-6 (2000)  
Target
Name:
Coagulation factor X
Synonyms:
Activated coagulation factor X (FXa) Coagulation factor X precursor F10 Factor X heavy chain Factor Xa Stuart-Prower factor
Type:
Enzyme
Mol. Mass.:
54726.60
Organism:
Homo sapiens (Human)
Description:
Residue:
488
  
Inhibitor
Name:
BDBM50090231
Synonyms:
CHEMBL39375 | MD805 Analogue
Type:
Small organic molecule
Emp. Form.:
C28H36N4O3S2
Mol. Mass.:
540.74
SMILES:
CCC1CCN(CC1)C(=O)C(Cc1nc2ccccc2s1)NS(=O)(=O)c1cccc2CC(C)(C)CNc12
: